The PoLyInfo Ontology, Schema
type: Ontology
imports: uo.owl
imports: iao.owl
imports: sio-release.owl
imports: rdf-schema#
creator: Koichi Sakamoto and Masashi Ishii
description: The PoLyInfo ontology that provides the vocabulary needed to describe polymeric data in RDF.
license: Creative Commons Attribution 4.0 International
comment: The PoLyInfo Ontology, Schema
label: PoLyInfo-Ontology_Schema
version info: 0.3

bearer propery
type: ObjectProperty
sub property of: topObjectProperty
domain: BFO_0000023
range: Class
  union of: BFO_0000020
  union of: BFO_0000031
comment: bearerProperty refers to the relationship between a role and the properties of the role bearer

has activation energy
type: ObjectProperty
sub property of: has model parameter
domain: Permeability coefficient Arrhenius equation
range: ActivationEnergy

has model parameter
type: ObjectProperty
sub property of: BFO_0000051

has prefactor
type: ObjectProperty
sub property of: has model parameter
domain: Permeability coefficient Arrhenius equation
range: Arrhenius equation prefactor

is estimated by
type: ObjectProperty
sub property of: topObjectProperty
domain: IAO_0000109
range: Permeability coefficient Arrhenius equation

is normalized to
type: ObjectProperty
sub property of: topObjectProperty
domain: Class
  union of: Material
  union of: Polymerization
range: Class
  union of: Material
  union of: Polymerization
comment: A relation between a sample level entity (such as a polymer sample or sample polymerization) and a master level entity (a polymer id or polymerization path id) in which the master level entity is a noramalized counterpart of the sample level entity.

realizes
type: ObjectProperty
sub property of: topObjectProperty
domain: BFO_0000040
range: BFO_0000017
comment: Realize the realizable entity indicated by the object here; unlike BFO:0000055 (realize), the subject need not be a process. (e.g., a list of compound objects realizes the pli:Component role held by each compound that is an element of the list).

has max value
type: DatatypeProperty
domain: Class
  union of: Descriptor
  union of: IAO_0000109
range: Literal

has min value
type: DatatypeProperty
domain: Class
  union of: Descriptor
  union of: IAO_0000109
range: Literal

Abbreviation
type: Class
subclass of: Name descriptor
comment: A subclass of the NameDescriptor Class, Abbreviation

ActivationEnergy
type: Class
subclass of: Arrhenius equation parameter
comment: A subclass of the ArrheniusEquationParameter Class, Activation Energy

AdditionCondensation
type: Class
subclass of: SequentialPolymerization
comment: A subclass of the SequentialPolymerization Class, Addition Condensation

AdditionPolymerization
type: Class
subclass of: ChainPolymerization
comment: A subclass of the ChainPolymerization Class, Addition Polymerization

Additive
type: Class
subclass of: General additive
comment: A subclass of the GeneralAdditive Class, Additive

Adhesion liquid
type: Class
subclass of: Contact substance role
comment: A subclass of the ContactSubstanceRole Class, Adhesion Liquid

Alias name
type: Class
subclass of: Name descriptor
comment: A subclass of the NameDescriptor Class, Alias Name

Alternating copolymer
type: Class
subclass of: Copolymer
comment: A subclass of the Copolymer Class, Alternating Copolymer

Amorphous state
type: Class
equivalent class: Class
  one of: Amorphous state
subclass of: Solid state type
type: NamedIndividual
comment: AmorphousState refers to Amorphous State as a Solid State Type.

Amount
type: Class
subclass of: Physical descriptor
comment: A subclass of the PhysicalDescriptor Class, Amount

Arrhenius equation parameter
type: Class
subclass of: Calculation model parameter
comment: A subclass of the CalculationModelParameter Class, Arrhenius Equation Parameter

Arrhenius equation prefactor
type: Class
subclass of: Arrhenius equation parameter
comment: A subclass of the ArrheniusEquationParameter Class, Arrhenius Equation Prefactor

Arrhenius equation prefactor unit
type: Class
subclass of: Unit
subclass of: UO_0000000

atmosphere
type: Class
equivalent class: Class
  one of: atmosphere
subclass of: atmosphere based unit
subclass of: Unit
subclass of: UO_0000109
type: NamedIndividual
has exact synonym: atm

atmosphere based unit
type: Class
subclass of: Unit
subclass of: UO_0000109

Average molecular measurement method
type: Class
subclass of: Measurement method
comment: A subclass of the MeasurementMethod Class, Average Molecular Measurement Method

Average molecular weight
type: Class
subclass of: Physical property
comment: A subclass of the PhysicalProperty Class, Average Molecular Weight

Average molecular weight measurement information
type: Class
subclass of: Chemical descriptor
comment: A subclass of the ChemicalDescriptor Class, Average Molecular Weight Measurement Information

Average molecular weight rate
type: Class
subclass of: Physical property
comment: A subclass of the PhysicalProperty Class, Average Molecular Weight Rate

bar
type: Class
equivalent class: Class
  one of: bar
subclass of: bar based unit
subclass of: Unit
subclass of: UO_0000109
type: NamedIndividual
has exact synonym: bar

bar based unit
type: Class
subclass of: Unit
subclass of: UO_0000109

Base material
type: Class
subclass of: Contact substance role
comment: A subclass of the ContactSubstanceRole Class, Base Material

Biodegradability
type: Class
subclass of: Physicochemical property
comment: A subclass of the PhysicochemicalProperty Class, Biodegradability

Blend
type: Class
subclass of: Polymer
comment: A subclass of the Polymer Class, Blend

Blend compatibilization (Kneading)
type: Class
subclass of: Material processing
comment: A subclass of the MaterialProcessing Class, Blend Compatibilization Kneading

Block copolymer
type: Class
subclass of: Copolymer
comment: A subclass of the Copolymer Class, Block Copolymer

Branching and crosslinking
type: Class
subclass of: Primary structure
comment: A subclass of the PrimaryStructure Class, Branching And Crosslinking

Branching and crosslinking type
type: Class
subclass of: Primary structure type
comment: A subclass of the PrimaryStructureType Class, Branching And Crosslinking Type

Brittleness temperature
type: Class
subclass of: Heat characteristic
comment: A subclass of the HeatCharacteristic Class, Brittleness Temperature

Bulk modulus
type: Class
subclass of: Other property
comment: A subclass of the OtherProperty Class, Bulk Modulus

Calculation model
type: Class
subclass of: IAO_0000030
comment: CalculationModel refers to a model that mimics and formulates measurable indicators.

Calculation model parameter
type: Class
subclass of: IAO_0000030
comment: CalculationModelParameter refers to the parameters included in the formula of CalculationModel.

calorie per centimeter second degree Celsius
type: Class
equivalent class: Class
  one of: calorie per centimeter second degree Celsius
subclass of: calorie per centimeter second degree Celsius based unit
subclass of: Unit
subclass of: UO_0000263
type: NamedIndividual
has exact synonym: cal/cm.s.C

calorie per centimeter second degree Celsius based unit
type: Class
subclass of: Unit
subclass of: UO_0000263

calorie per cubic centimeter
type: Class
equivalent class: Class
  one of: calorie per cubic centimeter
subclass of: calorie per cubic centimeter based unit
subclass of: specific energy unit
type: NamedIndividual
has exact synonym: cal/cc
has exact synonym: cal/cm^[3]

calorie per cubic centimeter based unit
type: Class
subclass of: specific energy unit

calorie per cubic centimeter degree Celsius
type: Class
equivalent class: Class
  one of: calorie per cubic centimeter degree Celsius
subclass of: calorie per cubic centimeter degree Celsius based unit
subclass of: specific heat capacity unit
type: NamedIndividual
has exact synonym: cal/cm^[3].C

calorie per cubic centimeter degree Celsius based unit
type: Class
subclass of: specific heat capacity unit

calorie per gram
type: Class
equivalent class: Class
  one of: calorie per gram
subclass of: calorie per gram based unit
subclass of: specific energy unit
type: NamedIndividual
has exact synonym: cal/g

calorie per gram based unit
type: Class
subclass of: specific energy unit

calorie per gram degree Celsius
type: Class
equivalent class: Class
  one of: calorie per gram degree Celsius
subclass of: calorie per gram degree Celsius based unit
subclass of: specific heat capacity unit
type: NamedIndividual
has exact synonym: cal/g.C

calorie per gram degree Celsius based unit
type: Class
subclass of: specific heat capacity unit

calorie per cubic centimeter based unit
type: Class
subclass of: specific energy unit

Catalyst
type: Class
subclass of: Chemical reaction role
comment: A subclass of the ChemicalReactionRole Class, Catalyst

centi newton per decitex
type: Class
equivalent class: Class
  intersection of: newton per decitex based unit
  intersection of: Restriction
    on property: has prefix
    some values from: UO_0000298
equivalent class: Class
  one of: centi newton per decitex
subclass of: specific strength unit
type: NamedIndividual
has exact synonym: cN/dtex

centi newton per tex
type: Class
equivalent class: Class
  intersection of: newton per tex based unit
  intersection of: Restriction
    on property: has prefix
    some values from: UO_0000298
equivalent class: Class
  one of: centi newton per tex
subclass of: specific strength unit
type: NamedIndividual
has exact synonym: cN/tex

centipoise
type: Class
equivalent class: Class
  intersection of: UO_1000258
  intersection of: Restriction
    on property: has prefix
    some values from: UO_0000298
subclass of: Unit
subclass of: UO_0000256
has exact synonym: cP

centistokes
type: Class
equivalent class: Class
  intersection of: stokes based unit
  intersection of: Restriction
    on property: has prefix
    some values from: UO_0000298
equivalent class: Class
  one of: centistokes
subclass of: kinematic viscosity unit
type: NamedIndividual
has exact synonym: cSt

ChainCondensationPolymerization
type: Class
subclass of: ChainPolymerization
comment: A subclass of the ChainPolymerization Class, Chain Condensation Polymerization

ChainPolymerization
type: Class
subclass of: Polymerization
comment: A subclass of the Polymerization Class, Chain Polymerization

Chain structure
type: Class
subclass of: Primary structure
comment: A subclass of the PrimaryStructure Class, Chain Structure

Charpy impact
type: Class
subclass of: Impact strength
comment: A subclass of the ImpactStrength Class, Charpy Impact

Chemical descriptor
type: Class
subclass of: Descriptor
comment: A subclass of the Descriptor Class, Chemical Descriptor

Chemical reaction role
type: Class
subclass of: Role
comment: A subclass of the Role Class, Chemical Reaction Role

Chemical substance
type: Class
subclass of: Material
comment: A subclass of the Material Class, Chemical Substance. Chemical Substance indicates the normalized material name. A material that can be lexicalized.

Cloud point
type: Class
subclass of: Structural property
comment: A subclass of the StructuralProperty Class, Cloud Point

Cohesive energy density
type: Class
subclass of: Physicochemical property
comment: A subclass of the PhysicochemicalProperty Class, Cohesive Energy Density

Commerce role
type: Class
subclass of: Role
comment: A subclass of the Role Class, Commerce Role

Component
type: Class
subclass of: Mixture role
comment: A subclass of the MixtureRole Class, Component

Composition ratio
type: Class
subclass of: Physical descriptor
comment: A subclass of the PhysicalDescriptor Class, CompositionRatio

Compound type
type: Class
subclass of: Type descriptor
comment: A subclass of the TypeDescriptor Class, Compound Type

Compressibility
type: Class
subclass of: Other property
comment: A subclass of the OtherProperty Class, Compressibility

Compressive creep property
type: Class
subclass of: Creep property
comment: A subclass of the CreepProperty Class, CompressiveCreepProperty

Compressive creep rupture strength
type: Class
subclass of: Compressive creep property
comment: A subclass of the CompressiveCreepProperty Class, Compressive Creep Rupture Strength

Compressive creep rupture time
type: Class
subclass of: Compressive creep property
comment: A subclass of the CompressiveCreepProperty Class, Compressive Creep Rupture Time

Compressive creep strain
type: Class
subclass of: Compressive creep property
comment: A subclass of the CompressiveCreepProperty Class, Compressive Creep Strain

Compressive loss modulus
type: Class
subclass of: Compressive property
comment: A subclass of the CompressiveProperty Class, Compressive Loss Modulus

Compressive loss tangent
type: Class
subclass of: Compressive property
comment: A subclass of the CompressiveProperty Class, Compressive Loss Tangent

Compressive modulus
type: Class
subclass of: Compressive property
comment: A subclass of the CompressiveProperty Class, Compressive Modulus

Compressive property
type: Class
subclass of: Property
comment: A subclass of the Property Class, Compressive property

Compressive storage modulus
type: Class
subclass of: Compressive property
comment: A subclass of the CompressiveProperty Class, Compressive Storage Modulus

Compressive stress (strength) at break
type: Class
subclass of: Compressive property
comment: A subclass of the CompressiveProperty Class, Compressive Stress Strength At Break

Compressive stress (strength) at yield
type: Class
subclass of: Compressive property
comment: A subclass of the CompressiveProperty Class, Compressive Stress Strength At Yield

Constitutional unit
type: Class
subclass of: Group of atoms
disjoint with: Junction unit
comment: A subclass of the GroupOfAtoms Class, Constitutional Unit

Contact angle
type: Class
subclass of: Relational property
comment: A subclass of the RelationalProperty Class, Contact Angle

Contact substance role
type: Class
subclass of: Role
comment: A subclass of the Role Class, Contact Substance Role

CoolingRate
type: Class
subclass of: Rate
comment: A subclass of the Rate Class, Cooling Rate

Copolymer
type: Class
subclass of: Polymer
comment: A subclass of the Polymer Class, Copolymer

Creep property
type: Class
subclass of: Property
comment: A subclass of the Property Class, Creep Property

Criterion event
type: Class
subclass of: BFO_0000015
comment: Event refers to anion formation, crosslinking, and other events.

Criterion event role
type: Class
subclass of: Measurement criterion role
comment: A subclass of the MeasurementCriterionRole Class, Criterion Event Role

Criterion property
type: Class
subclass of: BFO_0000020
comment: CriterionProperty refers to the physical and chemical properties dealt in PoLyInfo whose value changes are used to define the values of another property.

Criterion property role
type: Class
subclass of: Measurement criterion role
comment: A subclass of the MeasurementCriterionRole Class, Criterion Property Role

Crystal state
type: Class
equivalent class: Class
  one of: Crystal state
subclass of: Solid state type
type: NamedIndividual
comment: CrystalState refers to Crystal State as a Solid State Type.

Crystal structural measurement method
type: Class
subclass of: Measurement method
comment: A subclass of the MeasurementMethod Class, Crystal Structural MeasurementMethod

Crystal system
type: Class
subclass of: Crystal state
comment: A subclass of the CrystalState Class, Crystal System

Crystal type
type: Class
subclass of: High order structure type
comment: A subclass of the HighOrderStructureType Class, Crystal Type

Crystallinity
type: Class
subclass of: Structural property
comment: A subclass of the StructuralProperty Class, Crystallinity

Crystallinity measurement method
type: Class
subclass of: Measurement method
comment: A subclass of the MeasurementMethod Class, Crystallinity Measurement Method

Crystallinity type
type: Class
subclass of: High order structure type
comment: A subclass of the HighOrderStructureType Class, Crystallinity Type

Crystallization kinetics
type: Class
subclass of: Thermal property
subclass of: Restriction
  on property: BFO_0000051
  some values from: k: Growth rate parameter of Avrami equation
subclass of: Restriction
  on property: BFO_0000051
  some values from: n: Nucleation parameter of Avrami equation
comment: A subclass of the ThermalProperty Class, Crystallization Kinetics

Crystallization temperature
type: Class
subclass of: Thermal property
comment: A subclass of the ThermalProperty Class, Crystallization Temperature

Cubic
type: Class
equivalent class: Class
  one of: Cubic
subclass of: Crystal system
type: NamedIndividual
comment: Cubic refers to Cubic as a Crystal System.

cubic centimeter mol per square gram
type: Class
equivalent class: Class
  one of: cubic centimeter mol per square gram
subclass of: cubic centimeter mol per square gram based unit
subclass of: second virial coefficient unit
type: NamedIndividual
has exact synonym: cm3*mol/g2
has exact synonym: cm^[3].mol/g^[2]

cubic centimeter mol per square gram based unit
type: Class
subclass of: second virial coefficient unit

cubic centimeter per gram
type: Class
equivalent class: Class
  intersection of: cubic meter per gram based unit
  intersection of: Restriction
    on property: has prefix
    some values from: UO_0000298
equivalent class: Class
  one of: cubic centimeter per gram
subclass of: Unit
subclass of: UO_0000059
type: NamedIndividual
has exact synonym: cm^[3]/g

cubic centimeter per gram degree Celsius
type: Class
equivalent class: Class
  intersection of: cubic meter per gram degree Celsius based unit
  intersection of: Restriction
    on property: has prefix
    some values from: UO_0000298
equivalent class: Class
  one of: cubic centimeter per gram degree Celsius
subclass of: thermal expansion unit
type: NamedIndividual
has exact synonym: cm^[3]/g.C

cubic centimeter per gram kelvin
type: Class
equivalent class: Class
  intersection of: cubic meter per gram kelvin based unit
  intersection of: Restriction
    on property: has prefix
    some values from: UO_0000298
equivalent class: Class
  one of: cubic centimeter per gram kelvin
subclass of: thermal expansion unit
type: NamedIndividual
has exact synonym: cm^[3]/g.k

cubic centimeter STP centimeter per square centimeter second cmHg
type: Class
equivalent class: Class
  one of: cubic centimeter STP centimeter per square centimeter second cmHg
subclass of: Arrhenius equation prefactor unit
subclass of: cubic centimeter STP centimeter per square centimeter second cmHg based unit
type: NamedIndividual
has exact synonym: cm3(STP)cm/(cm2*s*cmHg)
has exact synonym: cm^[3](STP)cm/(cm^[2].s.cmHg)

cubic centimeter STP centimeter per square centimeter second cmHg based unit
type: Class
subclass of: Arrhenius equation prefactor unit

cubic centimeter STP centimeter per square centimeter second pascal
type: Class
equivalent class: Class
  one of: cubic centimeter STP centimeter per square centimeter second pascal
subclass of: cubic centimeter STP centimeter per square centimeter second pascal based unit
subclass of: gas permeability coefficient unit
type: NamedIndividual
has exact synonym: cm3(STP)cm/(cm2*s*Pa)
has exact synonym: cm^[3](STP)cm/(cm^[2].s.Pa)

cubic centimeter STP centimeter per square centimeter second pascal based unit
type: Class
subclass of: gas permeability coefficient unit

cubic centimeter STP centimeter per square meter 24hours atm
type: Class
equivalent class: Class
subclass of: gas permeability coefficient unit
type: NamedIndividual
has exact synonym: cm3(STP)cm/(m2*24h*atm)
has exact synonym: cm^[3](STP)cm/(m^[2].24h.atm)

cubic centimeter STP centimeter per square meter 24hours atm
type: Class
subclass of: gas permeability coefficient unit

cubic centimeter STP per cubic centimeter atm
type: Class
equivalent class: Class
  one of: cubic centimeter STP per cubic centimeter atm
subclass of: cubic centimeter STP per cubic centimeter atm based unit
subclass of: gas solubility coefficient unit
type: NamedIndividual
has exact synonym: cm3(STP)/(cm3*Pa)
has exact synonym: cm^[3](STP)/(cm^[3].Pa)

cubic centimeter STP per cubic centimeter atm based unit
type: Class
subclass of: gas solubility coefficient unit

cubic centimeter STP per cubic centimeter cmHg
type: Class
equivalent class: Class
  one of: cubic centimeter STP per cubic centimeter cmHg
subclass of: cubic centimeter STP per cubic centimeter cmHg based unit
subclass of: gas solubility coefficient unit
type: NamedIndividual
has exact synonym: cm3(STP)/(cm3*Pa)
has exact synonym: cm^[3](STP)/(cm^[3].Pa)

cubic centimeter STP per cubic centimeter cmHg based unit
type: Class
subclass of: gas solubility coefficient unit

cubic centimeter STP per cubic centimeter pascal
type: Class
equivalent class: Class
  one of: cubic centimeter STP per cubic centimeter pascal
subclass of: cubic centimeter STP per cubic centimeter pascal based unit
subclass of: gas solubility coefficient unit
type: NamedIndividual
has exact synonym: cm3(STP)/(cm3*Pa)
has exact synonym: cm^[3](STP)/(cm^[3].Pa)

cubic centimeter STP per cubic centimeter pascal based unit
type: Class
subclass of: gas solubility coefficient unit

cubic meter per gram
type: Class
equivalent class: Class
  one of: cubic meter per gram
subclass of: cubic meter per gram based unit
subclass of: Unit
subclass of: UO_0000059
type: NamedIndividual
has exact synonym: m^[3]/g

cubic meter per gram based unit
type: Class
subclass of: Unit
subclass of: UO_0000059

cubic meter per gram degree Celsius based unit
type: Class
subclass of: thermal expansion unit

cubic meter per gram kelvin based unit
type: Class
subclass of: thermal expansion unit

D value
type: Class
subclass of: Structural property
comment: A subclass of the StructuralProperty Class, D-Value

deciliter per gram
type: Class
equivalent class: Class
  intersection of: liter per gram based unit
  intersection of: Restriction
    on property: has prefix
    some values from: UO_0000296
equivalent class: Class
  one of: deciliter per gram
subclass of: Unit
subclass of: UO_0000059
type: NamedIndividual
has exact synonym: dl/g

Deflection temperature under load(HDT)
type: Class
subclass of: Heat characteristic
comment: A subclass of the HeatCharacteristic Class, Deflection Temperature Under Load Hdt

degree Celsius per minute
type: Class
equivalent class: Class
  one of: degree Celsius per minute
subclass of: degree Celsius per minute based unit
subclass of: heating rate unit
type: NamedIndividual
has exact synonym: C/min

degree Celsius per minute based unit
type: Class
subclass of: heating rate unit

degree Celsius per second
type: Class
equivalent class: Class
  one of: degree Celsius per second
subclass of: degree Celsius per second based unit
subclass of: heating rate unit
type: NamedIndividual
has exact synonym: C/s

degree Celsius per second based unit
type: Class
subclass of: heating rate unit

degree;degree
type: Class
subclass of: Unit
subclass of: UO_0000121
has exact synonym: degree;degree

degree;degree based unit
type: Class
subclass of: Unit
subclass of: UO_0000121

Degree of orientation
type: Class
subclass of: Structural property
comment: A subclass of the StructuralProperty Class, Degree Of Orientation

Degree of orientation measurement method
type: Class
subclass of: Measurement method
comment: A subclass of the MeasurementMethod Class, Degree Of Orientation Measurement Method

Degree of polymerization
type: Class
subclass of: Structural property
comment: A subclass of the StructuralProperty Class, Degree Of Polymerization

Density
type: Class
subclass of: Physical property
comment: A subclass of the PhysicalProperty Class, Density

Descriptor
type: Class
subclass of: IAO_0000027
comment: Descriptor refers to descriptors about concepts on PoLyInfo.

Dielectric breakdown voltage
type: Class
subclass of: Electrical property
comment: A subclass of the ElectricalProperty Class, Dielectric Breakdown Voltage

Dielectric constant (AC)
type: Class
subclass of: Electrical property
comment: A subclass of the ElectricalProperty Class, Dielectric Constant AC

Dielectric constant (DC)
type: Class
subclass of: Electrical property
comment: A subclass of the ElectricalProperty Class, Dielectric Constant DC

Dielectric dispersion
type: Class
subclass of: Electrical property
subclass of: Restriction
  on property: BFO_0000051
  some values from: Dielectric constant (AC)
subclass of: Restriction
  on property: BFO_0000051
  some values from: Dielectric loss factor
subclass of: Restriction
  on property: BFO_0000051
  some values from: Dielectric loss tangent
comment: A subclass of the ElectricalProperty Class, Dielectric Dispersion

Dielectric loss factor
type: Class
subclass of: Electrical property
comment: A subclass of the ElectricalProperty Class, Dielectric Loss Factor

Dielectric loss tangent
type: Class
subclass of: Electrical property
comment: A subclass of the ElectricalProperty Class, Dielectric Loss Tangent

Diffusion coefficient
type: Class
subclass of: Relational property
comment: A subclass of the RelationalProperty Class, Diffusion Coefficient

Dilute solution property
type: Class
subclass of: Property
comment: A subclass of the Property Class, Dilute Solution Property

Dissolution
type: Class
subclass of: BFO_0000015
comment: Dissolution refers to the dissolution that actually occurred in the samples dealt in PoLyInfo.

Dissolved
type: Class
subclass of: Solution component role
comment: A subclass of the SolutionComponentRole Class, Dissolved

Dopant
type: Class
subclass of: General additive
comment: A subclass of the GeneralAdditive Class, Dopant

Doping level
type: Class
subclass of: Amount
comment: A subclass of the Amount Class, Doping Level

Duration
type: Class
subclass of: Time
comment: A subclass of the Time Class, Duration

Dynamic compressive property
type: Class
subclass of: Compressive property
subclass of: Restriction
  on property: BFO_0000051
  some values from: Compressive loss modulus
subclass of: Restriction
  on property: BFO_0000051
  some values from: Compressive loss tangent
subclass of: Restriction
  on property: BFO_0000051
  some values from: Compressive storage modulus
comment: A subclass of the CompressiveProperty Class, Dynamic Compressive Property

Dynamic flexural property
type: Class
subclass of: Flexural property
subclass of: Restriction
  on property: BFO_0000051
  some values from: Flexural loss modulus
subclass of: Restriction
  on property: BFO_0000051
  some values from: Flexural loss tangent
subclass of: Restriction
  on property: BFO_0000051
  some values from: Flexural storage modulus
comment: A subclass of the FlexuralProperty Class, Dynamic Flexural Property

Dynamic loss viscosity [eta2]
type: Class
subclass of: Rheological property
comment: A subclass of the RheologicalProperty Class, Dynamic Loss Viscosity Eta2

Dynamic shear property
type: Class
subclass of: Shear property
subclass of: Restriction
  on property: BFO_0000051
  some values from: Shear loss modulus
subclass of: Restriction
  on property: BFO_0000051
  some values from: Shear loss tangent
subclass of: Restriction
  on property: BFO_0000051
  some values from: Shear storage modulus
comment: A subclass of the ShearProperty Class, Dynamic Shear Property

Dynamic storage viscosity [eta1]
type: Class
subclass of: Rheological property
comment: A subclass of the RheologicalProperty Class, Dynamic Storage Viscosity Eta1

Dynamic tensile property
type: Class
subclass of: Tensile property
subclass of: Restriction
  on property: BFO_0000051
  some values from: Tensile loss modulus
subclass of: Restriction
  on property: BFO_0000051
  some values from: Tensile loss tangent
subclass of: Restriction
  on property: BFO_0000051
  some values from: Tensile storage modulus
comment: A subclass of the TensileProperty Class, Dynamic Tensile Property

Dynamic viscosity
type: Class
subclass of: Rheological property
subclass of: Restriction
  on property: BFO_0000051
  some values from: Dynamic loss viscosity [eta2]
subclass of: Restriction
  on property: BFO_0000051
  some values from: Dynamic storage viscosity [eta1]
subclass of: Restriction
  on property: BFO_0000051
  some values from: Dynamic viscosity loss tangent
comment: A subclass of the RheologicalProperty Class, Dynamic Viscosity

Dynamic viscosity loss tangent
type: Class
subclass of: Rheological property
comment: A subclass of the RheologicalProperty Class, Dynamic Viscosity Loss Tangent

elastic compliance unit
type: Class
subclass of: Unit
subclass of: UO_0000000

Electric conductivity
type: Class
subclass of: Electric resistivity
comment: A subclass of the ElectricResistivity Class, Electric Conductivity

Electric resistivity
type: Class
subclass of: Electrical property
comment: A subclass of the ElectricalProperty Class, Electric Resistivity

Electrical property
type: Class
subclass of: Property
comment: A subclass of the Property Class, Electrical Property

Elongation
type: Class
subclass of: Dynamic tensile property
comment: A subclass of the Dynam icTensileProperty Class, Elongation

Elongation at break
type: Class
subclass of: Elongation
comment: A subclass of the Elongation Class, Elongation At Break

Elongation at yield
type: Class
subclass of: Elongation
comment: A subclass of the Elongation Class, Elongation At Yield

End group
type: Class
subclass of: Group of atoms
comment: A subclass of the GroupOfAtoms Class, End Group

End group connection
type: Class
subclass of: End group structure
comment: A subclass of the EndGroupStructure Class, End Group Connection

End group connection type
type: Class
subclass of: Primary structure type
comment: A subclass of the PrimaryStructureType Class, End Group Connection Type

End group part type
type: Class
subclass of: Primary structure type
comment: A subclass of the PrimaryStructureType Class, End Group Part Type

End group structure
type: Class
subclass of: Primary structure
comment: A subclass of the PrimaryStructure Class, End Group Structure

End group type
type: Class
subclass of: Primary structure type
comment: A subclass of the PrimaryStructureType Class, End Group Type

erg per cubic centimeter
type: Class
equivalent class: Class
  one of: erg per cubic centimeter
subclass of: erg per cubic centimeter based unit
subclass of: specific energy unit
type: NamedIndividual
has exact synonym: erg/cc
has exact synonym: erg/cm^[3]

erg per cubic centimeter based unit
type: Class
subclass of: specific energy unit

erg per cubic centimeter kelvin
type: Class
equivalent class: Class
  one of: erg per cubic centimeter kelvin
subclass of: erg per cubic centimeter kelvin based unit
subclass of: specific heat capacity unit
type: NamedIndividual
has exact synonym: erg/cm^[3].K

erg per cubic centimeter kelvin based unit
type: Class
subclass of: specific heat capacity unit

erg per square centimeter
type: Class
subclass of: erg per square centimeter based unit
subclass of: Unit
subclass of: UO_0000253

erg per square centimeter based unit
type: Class
subclass of: Unit
subclass of: UO_0000253

Fiber tensile
type: Class
subclass of: Dynamic tensile property
comment: A subclass of the Dynam icTensileProperty Class, Fiber Tensile

Fiber tensile elongation at break
type: Class
subclass of: Fiber tensile
comment: A subclass of the FiberTensile Class, Fiber Tensile Elongation At Break

Fiber tensile modulus
type: Class
subclass of: Fiber tensile
comment: A subclass of the FiberTensile Class, Fiber Tensile Modulus

Fiber tensile stress (strength) at break
type: Class
subclass of: Fiber tensile
comment: A subclass of the FiberTensile Class, Fiber Tensile Stress Strength At Break

Filler
type: Class
subclass of: General additive
comment: A subclass of the GeneralAdditive Class, Filler

Flexural creep property
type: Class
subclass of: Creep property
comment: A subclass of the CreepProperty Class, Flexural CreepProperty

Flexural creep rupture strength
type: Class
subclass of: Flexural creep property
comment: A subclass of the FlexuralCreepProperty Class, Flexural Creep Rupture Strength

Flexural creep rupture time
type: Class
subclass of: Flexural creep property
comment: A subclass of the FlexuralCreepProperty Class, Flexural Creep Rupture Time

Flexural creep strain
type: Class
subclass of: Flexural creep property
comment: A subclass of the FlexuralCreepProperty Class, Flexural Creep Strain

Flexural loss modulus
type: Class
subclass of: Flexural property
comment: A subclass of the FlexuralProperty Class, Flexural Loss Modulus

Flexural loss tangent
type: Class
subclass of: Flexural property
comment: A subclass of the FlexuralProperty Class, Flexural Loss Tangent

Flexural modulus
type: Class
subclass of: Flexural property
comment: A subclass of the FlexuralProperty Class, Flexural Modulus

Flexural property
type: Class
subclass of: Property
comment: A subclass of the Property Class, Flexural Property

Flexural storage modulus
type: Class
subclass of: Flexural property
comment: A subclass of the FlexuralProperty Class, Flexural Storage Modulus

Flexural stress (strength) at break
type: Class
subclass of: Flexural property
comment: A subclass of the FlexuralProperty Class, Flexural Stress Strength At Break

Flexural stress (strength) at yield
type: Class
subclass of: Flexural property
comment: A subclass of the FlexuralProperty Class, Flexural Stress Strength At Yield

Fluid state
type: Class
subclass of: Physical state
comment: A subclass of the PhysicalState Class, Fluid State

Fluid state type
type: Class
subclass of: Physical state type
comment: A subclass of the PhysicalStateType Class, Fluid State Type

Fraction
type: Class
subclass of: Molecular descriptor
comment: A subclass of the MolecularDescriptor Class, Fraction

Frequency
type: Class
subclass of: Physical descriptor
comment: A subclass of the PhysicalDescriptor Class, Frequency

Functional descriptor
type: Class
subclass of: Descriptor
comment: A subclass of the Descriptor Class, Functional Descriptor

G value
type: Class
subclass of: Other property
comment: A subclass of the OtherProperty Class, G Value

G value type
type: Class
subclass of: Property value type
comment: A subclass of the PropertyValueType Class, G Value Type

Gas diffusion coefficient (D)
type: Class
subclass of: Gas permeability and diffusion
comment: A subclass of the GasPermeabilityAndDiffusion Class, Gas Diffusion Coefficient D

Gas permeability and diffusion
type: Class
subclass of: Relational property
comment: A subclass of the RelationalProperty Class, Gas Permeability And Diffusion

Gas permeability coefficient (P)
type: Class
subclass of: Gas permeability and diffusion
comment: A subclass of the GasPermeabilityAndDiffusion Class, Gas Permeability Coefficient P

gas permeability coefficient unit
type: Class
subclass of: Unit
subclass of: UO_0000000

Gas solubility coefficient (S)
type: Class
subclass of: Gas permeability and diffusion
comment: A subclass of the GasPermeabilityAndDiffusion Class, Gas Solubility Coefficient S

gas solubility coefficient unit
type: Class
subclass of: solubility parameter unit

Gaseous state
type: Class
equivalent class: Class
  one of: Gaseous state
subclass of: Fluid state type
type: NamedIndividual
comment: GaseousState refers to Gaseous State as a Fluid State Type.

General additive
type: Class
subclass of: Mixture role
comment: A subclass of the MixtureRole Class, General Additive

General feature
type: Class
subclass of: Shape
comment: A subclass of the Shape Class, General Feature

Geometric descriptor
type: Class
subclass of: Descriptor
comment: A subclass of the Descriptor Class, Geometric Descriptor

Geometric property
type: Class
subclass of: Property
comment: A subclass of the Property Class, Geometric Property

gigapascal
type: Class
equivalent class: Class
  intersection of: UO_1000110
  intersection of: Restriction
    on property: has prefix
    some values from: UO_0000292
equivalent class: Class
  one of: gigapascal
subclass of: Unit
subclass of: UO_0000109
type: NamedIndividual
has exact synonym: GPa

Glass transition temperature
type: Class
subclass of: Thermal property
comment: A subclass of the ThermalProperty Class, Glass Transition Temperature

Good solvent
type: Class
subclass of: Solution component role
comment: A subclass of the SolutionComponentRole Class, Good Solvent

GPC (SEC) peak molecular weight
type: Class
subclass of: Average molecular weight
comment: A subclass of the AverageMolecularWeight Class, GPC (SEC) Peak Molecular Weight (Mp)

Graft copolymer
type: Class
subclass of: Copolymer
comment: A subclass of the Copolymer Class, Graft Copolymer

gram-force based unit
type: Class
subclass of: Unit
subclass of: UO_0000107

gram-force per denier
type: Class
equivalent class: Class
  one of: gram-force per denier
subclass of: gram-force per denier based unit
subclass of: specific strength unit
type: NamedIndividual
has exact synonym: gf/denier
has related synonym: g/denier

gram-force per denier based unit
type: Class
subclass of: specific strength unit

gram-force per square centimeter based unit
type: Class
subclass of: Unit
subclass of: UO_0000109

gram-force per square millimeter
type: Class
equivalent class: Class
  one of: gram-force per square millimeter
subclass of: gram-force per square millimeter based unit
subclass of: Unit
subclass of: UO_0000109
type: NamedIndividual
has exact synonym: gf/mm^[2]
has related synonym: g/mm^[2]

gram-force per square millimeter based unit
type: Class
subclass of: Unit
subclass of: UO_0000109

gram mil per square centimeter 24 hours
type: Class
equivalent class: Class
  one of: gram mil per square centimeter 24 hours
subclass of: water vapor transmission unit
type: NamedIndividual

gram mil per square centimeter 24 hours based unit
type: Class
subclass of: water vapor transmission unit

gram per hour centimeter MillimeterHg
type: Class
equivalent class: Class
  one of: gram per hour centimeter MillimeterHg
subclass of: gram per hour centimeter MillimeterHg based unit
subclass of: mass diffusivity unit
type: NamedIndividual
has related synonym: g/h.cm.mmHg

gram per hour centimeter MillimeterHg based unit
type: Class
subclass of: mass diffusivity unit

Group of atoms
type: Class
subclass of: Structure descriptor
comment: A subclass of the StructureDescriptor Class, Group Of Atoms

Half-time of crystallization
type: Class
subclass of: Crystallization kinetics
comment: A subclass of the CrystallizationKinetics Class, Half Time Of Crystallization

Hansen parameter
type: Class
subclass of: Physicochemical property
subclass of: Restriction
  on property: BFO_0000051
  some values from: Hansen parameter (delta-d: dispersion component)
subclass of: Restriction
  on property: BFO_0000051
  some values from: Hansen parameter (delta-h: hydrogen bonding)
subclass of: Restriction
  on property: BFO_0000051
  some values from: Hansen parameter (delta-p: polar)
comment: A subclass of the PhysicochemicalProperty Class, Hansen Parameter

Hansen parameter (delta-d: dispersion component)
type: Class
subclass of: Physicochemical property
comment: A subclass of the PhysicochemicalProperty Class, Hansen Parameter Delta-d Dispersion Component

Hansen parameter (delta-h: hydrogen bonding)
type: Class
subclass of: Physicochemical property
comment: A subclass of the PhysicochemicalProperty Class, Hansen Parameter Delta-h Hydrogen Bonding

Hansen parameter (delta-p: polar)
type: Class
subclass of: Physicochemical property
comment: A subclass of the PhysicochemicalProperty Class, Hansen Parameter Delta-P Polar

Hardness
type: Class
subclass of: Property
comment: A subclass of the Property Class, Hardness

heat capacity unit
type: Class
subclass of: Unit
subclass of: UO_0000000

Heat characteristic
type: Class
subclass of: Property
comment: A subclass of the Property Class, Heat Characteristic

Heat conduction
type: Class
subclass of: Thermal property
comment: A subclass of the ThermalProperty Class, Heat Conduction

Heat of crystallization
type: Class
subclass of: Thermal property
comment: A subclass of the ThermalProperty Class, Heat Of Crystallization

Heat of fusion
type: Class
subclass of: Thermal property
comment: A subclass of the ThermalProperty Class, Heat Of Fusion

Heat of fusion (mol conversion)
type: Class
subclass of: Heat of fusion
comment: A subclass of the HeatOfFusion Class, Heat Of Fusion Mol Conversion

Heat resistance and Combustion
type: Class
subclass of: Property
comment: A subclass of the Property Class, Heat Resistance And Combustion

HeatingRate
type: Class
subclass of: Rate
comment: A subclass of the Rate Class, Heating Rate

heating rate unit
type: Class
subclass of: Unit
subclass of: UO_0000000

Hexagonal
type: Class
equivalent class: Class
  one of: Hexagonal
subclass of: Crystal system
type: NamedIndividual
comment: Hexagonal refers to Hexagonal as a Crystal System.

High order structure
type: Class
subclass of: Structure descriptor
IAO_0000116: HighOrderStructure refers to the higher-order structure, including the crystal structure, contained in a substance
comment: A subclass of the StructureDescriptor Class, High Order Structure

High order structure type
type: Class
subclass of: Structure type
comment: A subclass of the SructureType, High Order Structure Type

Homopolymer
type: Class
subclass of: Polymer
comment: A subclass of the Polymer Class, Homopolymer

Impact strength
type: Class
subclass of: Property
comment: A subclass of the Property Class, Impact Strength

Inchi
type: Class
subclass of: Molecular descriptor
comment: A subclass of the MolecularDescriptor Class, Inchi

InchiKey
type: Class
subclass of: Molecular descriptor
comment: A subclass of the MolecularDescriptor Class, InchiKey

Initiator
type: Class
subclass of: Polymerization role
comment: A subclass of the PolymerizationRole Class, Initiator

Interfacial tension
type: Class
subclass of: Relational property
comment: A subclass of the RelationalProperty Class, Interfacial Tension

Intrinsic viscosity [eta]
type: Class
subclass of: Relational property
comment: A subclass of the RelationalProperty Class, Intrinsic Viscosity Eta

Isothermal weight loss
type: Class
subclass of: Thermal decomposition
comment: A subclass of the ThermalDecomposition Class, Isothermal Weight Loss

IUPAC name
type: Class
subclass of: Name descriptor
comment: A subclass of the NameDescriptor Class, IUPAC Name

Izod impact
type: Class
subclass of: Impact strength
comment: A subclass of the ImpactStrength Class, Izod Impact

Japanese name
type: Class
subclass of: Name descriptor
comment: A subclass of the NameDescriptor Class, Japanese Name

joule per cubic centimeter
type: Class
equivalent class: Class
  one of: joule per cubic centimeter
subclass of: joule per cubic centimeter based unit
subclass of: specific energy unit
type: NamedIndividual
has exact synonym: J/cc
has exact synonym: J/cm^[3]

joule per cubic centimeter based unit
type: Class
subclass of: specific energy unit

joule per cubic centimeter kelvin
type: Class
equivalent class: Class
  one of: joule per cubic centimeter kelvin
subclass of: joule per cubic centimeter kelvin based unit
subclass of: specific heat capacity unit
type: NamedIndividual
has exact synonym: J/cm^[3].K

joule per cubic centimeter kelvin based unit
type: Class
subclass of: specific heat capacity unit

joule per cubic meter kelvin
type: Class
equivalent class: Class
  one of: joule per cubic meter kelvin
subclass of: joule per cubic meter kelvin based unit
subclass of: specific heat capacity unit
type: NamedIndividual
has exact synonym: J/m^[3].K

joule per cubic meter kelvin based unit
type: Class
subclass of: specific heat capacity unit

joule per kelvin
type: Class
equivalent class: Class
  one of: joule per kelvin
subclass of: heat capacity unit
subclass of: joule per kelvin based unit
type: NamedIndividual
has exact synonym: J/K

joule per kelvin based unit
type: Class
subclass of: heat capacity unit

joule per meter
type: Class
equivalent class: Class
  one of: joule per meter
subclass of: joule per meter based unit
subclass of: Unit
subclass of: UO_0000107
type: NamedIndividual

joule per meter based unit
type: Class
subclass of: Unit
subclass of: UO_0000107

joule per mol
type: Class
equivalent class: Class
  one of: joule per mol
subclass of: joule per mol based unit
subclass of: specific energy unit
type: NamedIndividual
has exact synonym: J/mol

joule per mol based unit
type: Class
subclass of: specific energy unit

joule per mol kelvin
type: Class
equivalent class: Class
  one of: joule per mol kelvin
subclass of: joule per mol kelvin based unit
subclass of: specific heat capacity unit
type: NamedIndividual
has exact synonym: J/mol.K

joule per mol kelvin based unit
type: Class
subclass of: specific heat capacity unit

joule per square meter based unit
type: Class
subclass of: Unit
subclass of: UO_0000107

joule per square millimeter based unit
type: Class
subclass of: Unit
subclass of: UO_0000253

Junction unit
type: Class
subclass of: Group of atoms
comment: A subclass of the GroupOfAtoms Class, Junction Unit

k: Growth rate parameter of Avrami equation
type: Class
subclass of: Thermal property
comment: A subclass of the ThermalProperty Class, K Growth Rate Parameter Of Avrami Equation

kelvin per hour
type: Class
equivalent class: Class
  one of: kelvin per hour
subclass of: heating rate unit
subclass of: kelvin per hour based unit
type: NamedIndividual
has exact synonym: K/h

kelvin per hour based unit
type: Class
subclass of: heating rate unit

kelvin per minute
type: Class
equivalent class: Class
  one of: kelvin per minute
subclass of: heating rate unit
subclass of: kelvin per minute based unit
type: NamedIndividual
has exact synonym: K/min

kelvin per minute based unit
type: Class
subclass of: heating rate unit

kilobar
type: Class
equivalent class: Class
  intersection of: bar based unit
  intersection of: Restriction
    on property: has prefix
    some values from: UO_0000294
equivalent class: Class
  one of: kilobar
subclass of: Unit
subclass of: UO_0000109
type: NamedIndividual
has exact synonym: kbar

kilocalorie per gram
type: Class
equivalent class: Class
  intersection of: calorie per gram based unit
  intersection of: Restriction
    on property: has prefix
    some values from: UO_0000294
equivalent class: Class
  one of: kilocalorie per gram
subclass of: specific energy unit
type: NamedIndividual
has exact synonym: kcal/g

kilocalorie per mol
type: Class
equivalent class: Class
  intersection of: calorie per cubic centimeter based unit
  intersection of: Restriction
    on property: has prefix
    some values from: UO_0000294
equivalent class: Class
  one of: kilocalorie per mol
subclass of: specific energy unit
type: NamedIndividual
has exact synonym: kcal/mol

kilogram centimeter per square centimeter
type: Class
equivalent class: Class
  one of: kilogram centimeter per square centimeter
subclass of: kilogram centimeter per square centimeter based unit
subclass of: Unit
subclass of: UO_0000253
type: NamedIndividual
has exact synonym: kg-cm/cm^[2]

kilogram centimeter per square centimeter based unit
type: Class
subclass of: Unit
subclass of: UO_0000253

kilogram-force
type: Class
equivalent class: Class
  intersection of: gram-force based unit
  intersection of: Restriction
    on property: has prefix
    some values from: UO_0000294
equivalent class: Class
  one of: kilogram-force
subclass of: Unit
subclass of: UO_0000107
type: NamedIndividual

kilogram-force per square centimeter
type: Class
equivalent class: Class
  intersection of: gram-force per square centimeter based unit
  intersection of: Restriction
    on property: has prefix
    some values from: UO_0000294
equivalent class: Class
  one of: kilogram-force per square centimeter
subclass of: Unit
subclass of: UO_0000109
type: NamedIndividual
has exact synonym: kgf/cm^[2]
has related synonym: kg/cm^[2]

kilogram-force per square millimeter
type: Class
equivalent class: Class
  intersection of: gram-force per square millimeter based unit
  intersection of: Restriction
    on property: has prefix
    some values from: UO_0000294
equivalent class: Class
  one of: kilogram-force per square millimeter
subclass of: Unit
subclass of: UO_0000109
type: NamedIndividual
has exact synonym: kgf/mm^[2]
has related synonym: kg/mm^[2]

kilojoule per meter
type: Class
equivalent class: Class
  intersection of: joule per meter based unit
  intersection of: Restriction
    on property: has prefix
    some values from: UO_0000294
equivalent class: Class
  one of: kilojoule per meter
subclass of: Unit
subclass of: UO_0000107
type: NamedIndividual

kilojoule per mol
type: Class
equivalent class: Class
  intersection of: joule per mol based unit
  intersection of: Restriction
    on property: has prefix
    some values from: UO_0000294
equivalent class: Class
  one of: kilojoule per mol
subclass of: specific energy unit
type: NamedIndividual
has exact synonym: kJ/mol

kilojoule per square meter
type: Class
equivalent class: Class
  intersection of: joule per square meter based unit
  intersection of: Restriction
    on property: has prefix
    some values from: UO_0000294
equivalent class: Class
  one of: kilojoule per square meter
subclass of: Unit
subclass of: UO_0000253
type: NamedIndividual

kilopond-force per square inch
type: Class
equivalent class: Class
  intersection of: pond-force per square inch based unit
  intersection of: Restriction
    on property: has prefix
    some values from: UO_0000294
equivalent class: Class
  one of: kilopond-force per square inch
subclass of: Unit
subclass of: UO_0000109
type: NamedIndividual
has exact synonym: ksi

kilovolt per millimeter
type: Class
equivalent class: Class
  intersection of: volt per millimeter based unit
  intersection of: Restriction
    on property: has prefix
    some values from: UO_0000294
equivalent class: Class
  one of: kilovolt per millimeter
subclass of: Unit
subclass of: UO_0000267
type: NamedIndividual
has exact synonym: kV/mm

kinematic viscosity unit
type: Class
subclass of: Unit
subclass of: UO_0000256

Lattice angle
type: Class
subclass of: Structural property
comment: A subclass of the StructuralProperty Class, Lattice Angle

Lattice angle (alpha)
type: Class
subclass of: Lattice angle
comment: A subclass of the LatticeAngle Class, Lattice Angle Alpha

Lattice angle (beta)
type: Class
subclass of: Lattice angle
comment: A subclass of the LatticeAngle Class, Lattice Angle Beta

Lattice angle (gamma)
type: Class
subclass of: Lattice angle
comment: A subclass of the LatticeAngle Class, Lattice Angle Gamma

Lattice constant
type: Class
subclass of: Structural property
comment: A subclass of the StructuralProperty Class, Lattice Constant

Lattice constant (a)
type: Class
subclass of: Lattice constant
comment: A subclass of the LatticeConstant Class, Lattice Constant A

Lattice constant (b)
type: Class
subclass of: Lattice constant
comment: A subclass of the LatticeConstant Class, Lattice Constant B

Lattice constant (c)
type: Class
subclass of: Lattice constant
comment: A subclass of the LatticeConstant Class, Lattice Constant C

LC phase transition temperature
type: Class
subclass of: Thermal property
comment: A subclass of the ThermalProperty Class, Lc Phase Transition Temperature

length percentage
type: Class
equivalent class: Class
  one of: length percentage
subclass of: length percentage based unit
subclass of: Unit
subclass of: UO_0000187
type: NamedIndividual
has exact synonym: %

length percentage based unit
type: Class
subclass of: Unit
subclass of: UO_0000187

Linear expansion coefficient
type: Class
subclass of: Thermal expansion
comment: A subclass of the ThermalExpansion Class, Linear Expansion Coefficient

Liquid crystal state
type: Class
equivalent class: Class
  one of: Liquid crystal state
subclass of: Fluid state type
type: NamedIndividual
comment: LiquidCrystalState refers to Liquid Crystal State as a Fluid State Type.

Liquid state
type: Class
equivalent class: Class
  one of: Liquid state
subclass of: Fluid state type
type: NamedIndividual
comment: LiquidState refers to Liquid State as a Fluid State Type.

liter per gram
type: Class
equivalent class: Class
  one of: liter per gram
subclass of: liter per gram based unit
subclass of: Unit
subclass of: UO_0000059
type: NamedIndividual
has exact synonym: l/g

liter per gram based unit
type: Class
subclass of: Unit
subclass of: UO_0000059

Main medium
type: Class
subclass of: Mixture role
comment: A subclass of the MixtureRole Class, Main medium

Manufacturer
type: Class
subclass of: Trade descriptor
comment: A subclass of the TradeDescriptor Class, Manufacturer

mass diffusivity unit
type: Class
subclass of: Unit
subclass of: UO_0000000

Material
type: Class
subclass of: BFO_0000040
comment: Material refers to a substance or type information identified based on its chemical structure etc.

Material processing
type: Class
subclass of: OBI_0000011
comment: MaterialProcessing refers to the planned process of physically operating on materials.

Measurement
type: Class
subclass of: OBI_0000011
comment: Measurement refers to the measurement process

Measurement criterion role
type: Class
subclass of: Role
comment: A subclass of the Role Class, Measurement Criterion Role

Measurement method
type: Class
subclass of: IAO_0000104
comment: MeasurementMethod refers to the method or indices used for measurement.

Measurement standard
type: Class
subclass of: IAO_0000104
comment: MeasurementStandard refers to the standard applied in the measurement

megajoule per cubic meter kelvin
type: Class
equivalent class: Class
  intersection of: joule per cubic meter kelvin based unit
  intersection of: Restriction
    on property: has prefix
    some values from: UO_0000293
equivalent class: Class
  one of: megajoule per cubic meter kelvin
subclass of: specific heat capacity unit
type: NamedIndividual
has exact synonym: MJ/m^[3].K

megapascal
type: Class
equivalent class: Class
  intersection of: UO_1000110
  intersection of: Restriction
    on property: has prefix
    some values from: UO_0000293
equivalent class: Class
  one of: megapascal
subclass of: Unit
subclass of: UO_0000109
type: NamedIndividual
has exact synonym: MPa

megarad
type: Class
equivalent class: Class
  intersection of: UO_1000135
  intersection of: Restriction
    on property: has prefix
    some values from: UO_0000293
subclass of: Unit
subclass of: UO_0000129
has exact synonym: Mrad

Melt flow rate
type: Class
subclass of: Rheological property
comment: A subclass of the RheologicalProperty Class, Melt Flow Rate

Melt flow rate measurement method
type: Class
subclass of: Measurement method
comment: A subclass of the MeasurementMethod Class, Melt Flow Rate Measurement Method

Melt flow rate measurement standard
type: Class
subclass of: Measurement standard
comment: A subclass of the MeasurementStandard Class, Melt Flow Rate Measurement Standard

Melt viscosity
type: Class
subclass of: Rheological property
comment: A subclass of the RheologicalProperty Class, Melt Viscosity

Melting temperature
type: Class
subclass of: Thermal property
comment: A subclass of the ThermalProperty Class, Melting Temperature

millijoule per kelvin
type: Class
equivalent class: Class
  intersection of: joule per kelvin based unit
  intersection of: Restriction
    on property: has prefix
    some values from: UO_0010009
equivalent class: Class
  one of: millijoule per kelvin
subclass of: heat capacity unit
type: NamedIndividual
has exact synonym: mJ/K

millijoule per mol kelvin
type: Class
equivalent class: Class
  intersection of: joule per mol kelvin based unit
  intersection of: Restriction
    on property: has prefix
    some values from: UO_0000297
equivalent class: Class
  one of: millijoule per mol kelvin
subclass of: specific heat capacity unit
type: NamedIndividual
has exact synonym: mJ/mol.K

millijoule per square meter
type: Class
equivalent class: Class
  intersection of: joule per square meter based unit
  intersection of: Restriction
    on property: has prefix
    some values from: UO_0010009
equivalent class: Class
  one of: millijoule per square meter
subclass of: Unit
subclass of: UO_0000253
type: NamedIndividual

millijoule per square millimeter
type: Class
equivalent class: Class
  intersection of: joule per square millimeter based unit
  intersection of: Restriction
    on property: has prefix
    some values from: UO_0000297
equivalent class: Class
  one of: millijoule per square millimeter
subclass of: Unit
subclass of: UO_0000253
type: NamedIndividual

milliliter per gram
type: Class
equivalent class: Class
  intersection of: liter per gram based unit
  intersection of: Restriction
    on property: has prefix
    some values from: UO_0000297
equivalent class: Class
  one of: milliliter per gram
subclass of: Unit
subclass of: UO_0000059
type: NamedIndividual
has exact synonym: ml/g

millinewton per meter
type: Class
equivalent class: Class
  intersection of: UO_1000254
  intersection of: Restriction
    on property: has prefix
    some values from: UO_0000297
equivalent class: Class
  one of: millinewton per meter
subclass of: Unit
subclass of: UO_0000253
type: NamedIndividual

milliwatt per centimeter kelvin
type: Class
equivalent class: Class
  intersection of: watt per centimeter kelvin based unit
  intersection of: Restriction
    on property: has prefix
    some values from: UO_0010009
equivalent class: Class
  one of: milliwatt per centimeter kelvin
subclass of: Unit
subclass of: UO_0000263
type: NamedIndividual
has exact synonym: mW/cm.K

Mixture role
type: Class
subclass of: Role
comment: A subclass of the Role Class, Mixture Role

Molding
type: Class
subclass of: Material processing
comment: A subclass of the MaterialProcessing Class, Molding

Molding method
type: Class
subclass of: IAO_0000104
comment: MoldingMethod refers to the method used in molding

Molding Sample Shape
type: Class
subclass of: Shape
comment: A subclass of the Shape Class, Molding Sample Shape

Molding treating
type: Class
subclass of: Material processing
comment: A subclass of the MaterialProcessing Class, Molding Treating

Molding treating method
type: Class
subclass of: IAO_0000104
comment: MoldingTreatingMethod refers to the treating method in molding

mole percentage
type: Class
equivalent class: Class
  one of: mole percentage
subclass of: mole percentage based unit
subclass of: Unit
subclass of: UO_0000187
type: NamedIndividual
has exact synonym: %

mole percentage based unit
type: Class
subclass of: Unit
subclass of: UO_0000187
has exact synonym: %

Molecular descriptor
type: Class
subclass of: Descriptor
comment: A subclass of the Descriptor Class, Molecular Descriptor

Molecular formula
type: Class
subclass of: Molecular descriptor
comment: A subclass of the MolecularDescriptor Class, Molecular Formula

Molecular weight
type: Class
subclass of: Molecular descriptor
comment: A subclass of the MolecularDescriptor Class, Molecular Weight

Monoclinic
type: Class
equivalent class: Class
  one of: Monoclinic
subclass of: Crystal system
type: NamedIndividual
comment: Monoclinic refers to Monoclinic as a Crystal System.

Monomer
type: Class
subclass of: Chemical substance
comment: A subclass of the ChemicalSubstance Class, Monomer

Morphology
type: Class
subclass of: Geometric property
comment: A subclass of the GeometricProperty Class, Morphology

n: Nucleation parameter of Avrami equation
type: Class
subclass of: Thermal property
comment: A subclass of the ThermalProperty Class, N Nucleation Parameter Of Avrami Equation

Name descriptor
type: Class
subclass of: Descriptor
disjoint with: Property
comment: A subclass of the Descriptor Class, Name Descriptor

nanometer per second
type: Class
equivalent class: Class
  intersection of: UO_1000094
  intersection of: Restriction
    on property: has prefix
    some values from: UO_0000300
equivalent class: Class
  one of: nanometer per second
subclass of: Unit
subclass of: UO_0000060
type: NamedIndividual
has exact synonym: nm/s

newton centimeter per gram
type: Class
equivalent class: Class
  one of: newton centimeter per gram
subclass of: newton centimeter per gram based unit
subclass of: specific strength unit
type: NamedIndividual
has related synonym: Ncm/g

newton centimeter per gram based unit
type: Class
subclass of: specific strength unit

newton per decitex based unit
type: Class
subclass of: specific strength unit

newton per square centimeter
type: Class
equivalent class: Class
  one of: newton per square centimeter
subclass of: newton per square centimeter based unit
subclass of: Unit
subclass of: UO_0000109
type: NamedIndividual
has exact synonym: N/cm^[2]

newton per square centimeter based unit
type: Class
subclass of: Unit
subclass of: UO_0000109

newton per square meter
type: Class
equivalent class: Class
  one of: newton per square meter
subclass of: newton per square meter based unit
subclass of: Unit
subclass of: UO_0000109
type: NamedIndividual
has exact synonym: N/m^[2]

newton per square meter based unit
type: Class
subclass of: Unit
subclass of: UO_0000109

newton per square millimeter
type: Class
equivalent class: Class
  one of: newton per square millimeter
subclass of: newton per square millimeter based unit
subclass of: Unit
subclass of: UO_0000109
type: NamedIndividual
has exact synonym: N/mm^[2]

newton per square millimeter based unit
type: Class
subclass of: Unit
subclass of: UO_0000109

newton per tex based unit
type: Class
subclass of: specific strength unit

Non solvent
type: Class
subclass of: Solution component role
comment: A subclass of the SolutionComponentRole Class, Non Solvent

Nonlinear electro-optic effect
type: Class
subclass of: Optical property
comment: A subclass of the OpticalProperty Class, Nonlinear Electro-Optic Effect

Nonlinear electro-optic effect coefficient
type: Class
subclass of: Calculation model parameter
comment: A subclass of the CalculationModelParameter Class, Nonlinear ElectroOptic Effect Coefficient

Number-average molecular weight
type: Class
subclass of: Average molecular weight
comment: A subclass of the AverageMolecularWeight Class, Number-Average Molecular Weight (Mn)

Number of CU in 1 unit cell
type: Class
subclass of: Structural property
comment: A subclass of the StructuralProperty Class, Number Of CU In 1 Unit Cell

ohm
type: Class
equivalent class: Class
  one of: ohm
subclass of: ohm based unit
subclass of: resistance unit
type: NamedIndividual
has exact synonym: ohm

ohm based unit
type: Class
subclass of: resistance unit

ohm centimeter
type: Class
equivalent class: Class
  intersection of: ohm meter based unit
  intersection of: Restriction
    on property: has prefix
    some values from: UO_0000298
equivalent class: Class
  one of: ohm centimeter
subclass of: volume resistivity unit
type: NamedIndividual
has exact synonym: ohm.cm

ohm meter
type: Class
equivalent class: Class
  one of: ohm meter
subclass of: ohm meter based unit
subclass of: volume resistivity unit
type: NamedIndividual
has exact synonym: ohm.m

ohm meter based unit
type: Class
subclass of: volume resistivity unit

ohm per square
type: Class
equivalent class: Class
  one of: ohm per square
subclass of: ohm per square based unit
subclass of: surface resistivity unit
type: NamedIndividual
has exact synonym: ohm/square

ohm per square based unit
type: Class
subclass of: surface resistivity unit

ohm per square centimeter
type: Class
equivalent class: Class
  one of: ohm per square centimeter
subclass of: ohm per square centimeter based unit
subclass of: surface resistivity unit
type: NamedIndividual
has exact synonym: ohm/cm^[3]

ohm per square centimeter based unit
type: Class
subclass of: surface resistivity unit

Opposite material
type: Class
subclass of: Contact substance role
comment: A subclass of the ContactSubstanceRole Class, Opposite Material

Optical property
type: Class
subclass of: Property
comment: A subclass of the Property Class, Optical Property

Optical purity
type: Class
subclass of: Optical property
comment: A subclass of the OpticalProperty Class, Optical Purity

Optical rotation
type: Class
subclass of: Optical property
comment: A subclass of the OpticalProperty Class, Optical Rotation

Orthorhombic
type: Class
equivalent class: Class
  one of: Orthorhombic
subclass of: Crystal system
type: NamedIndividual
comment: Orthorhombic refers to Orthorhombic as a Crystal System.

Other name
type: Class
subclass of: Name descriptor
comment: A subclass of the NameDescriptor Class, Other Name

Other property
type: Class
subclass of: Property
comment: A subclass of the Property Class, OtherProperty

Oxygen index
type: Class
subclass of: Heat resistance and Combustion
comment: A subclass of the HeatResistanceAndCombustion Class, Oxygen Index

per degree Celsius
type: Class
equivalent class: Class
  one of: per degree Celsius
subclass of: per celsius based unit
subclass of: thermal expansion unit
type: NamedIndividual
has exact synonym: 1/C

per celsius based unit
type: Class
subclass of: thermal expansion unit
subclass of: UO_0000005

per gigapascal
type: Class
equivalent class: Class
  one of: per gigapascal
subclass of: elastic compliance unit
subclass of: per gigapascal based unit
type: NamedIndividual
has exact synonym: 1/GPa

per gigapascal based unit
type: Class
subclass of: elastic compliance unit

per kelvin
type: Class
equivalent class: Class
  one of: per kelvin
subclass of: per kelvin based unit
subclass of: thermal expansion unit
type: NamedIndividual
has exact synonym: 1/K

per kelvin based unit
type: Class
subclass of: thermal expansion unit
subclass of: UO_0000005

per ohm centimeter
type: Class
equivalent class: Class
  one of: per ohm centimeter
subclass of: per ohm centimeter based unit
subclass of: Unit
subclass of: UO_0000262
type: NamedIndividual
has exact synonym: 1/ohm.cm

per ohm centimeter based unit
type: Class
subclass of: Unit
subclass of: UO_0000262

Periodic copolymer
type: Class
subclass of: Copolymer
comment: A subclass of the Copolymer Class, Periodic Copolymer

Permeability coefficient Arrhenius equation
type: Class
subclass of: Calculation model
comment: A subclass of the CalculationModel Class, Permeability Coefficient Arrhenius Equation

Permeable substance role
type: Class
subclass of: Role
comment: A subclass of the Role Class, Permeable Substance Role

Permeant gas molecular
type: Class
subclass of: Permeable substance role
comment: A subclass of the PermeableSubstanceRole Class, Permeant Gas Molecular

Permeant other
type: Class
subclass of: Permeable substance role
comment: A subclass of the PermeableSubstanceRole Class, Permeant Other

phr
type: Class
subclass of: Unit

phr based unit
type: Class
subclass of: Unit

Physical descriptor
type: Class
subclass of: Descriptor
comment: A subclass of the Descriptor Class, Physical Descriptor

Physical property
type: Class
subclass of: Property
comment: A subclass of the Property Class, Physical Property

Physical state
type: Class
subclass of: Structural property
comment: A subclass of the StructuralProperty Class, PhysicalState

Physical state type
type: Class
subclass of: Property value type
comment: A subclass of the PropertyValueType Class, Physical State Type

Physicochemical property
type: Class
subclass of: Property
comment: A subclass of the Property Class, Physicochemical Property

Polyaddition
type: Class
subclass of: SequentialPolymerization
comment: A subclass of the SequentialPolymerization Class, Polyaddition

Polycondensation
type: Class
subclass of: SequentialPolymerization
comment: A subclass of the SequentialPolymerization Class, Polycondensation

Polymer
type: Class
subclass of: Chemical substance
comment: A subclass of the ChemicalSubstance Class, Polymer

Polymer sample
type: Class
subclass of: Sample structured material
comment: A subclass of the SampleStructuedMaterial Class, Polymer Sample

Polymer class
type: Class
subclass of: Compound type
IAO_0000116: The polymer class is determined based on the pattern of the chemical structure of the polymer; the notation in the PoLyInfo GUI is Polymer Class. On the other hand, the URI, pli:PolymerType is due to the structure of the ontology. To explicitly indicate this, the labels and URIs were different.
comment: A subclass of the CompoundType Class, Polymer Type.

Polymerization
type: Class
subclass of: BFO_0000015
comment: Polymerization refers to the polymerization that actually occurred in the samples dealt in PoLyInfo.

Polymerization mechanism type
type: Class
subclass of: Polymerization type
comment: A subclass of the PolymerizationType Class, Polymerization Mechanism Type

Polymerization phase type
type: Class
subclass of: Polymerization type
comment: A subclass of the PolymerizationType Class, Polymerization Phase Type

Polymerization reaction type
type: Class
subclass of: Polymerization type
comment: A subclass of the PolymerizationType Class, Polymerization Reaction Type

Polymerization role
type: Class
subclass of: Chemical reaction role
comment: A subclass of the ChemicalReactionRole Class, Polymerization Role

Polymerization type
type: Class
subclass of: Type descriptor
comment: A subclass of the TypeDescriptor Class, Polymerization Type

pond-force per square inch based unit
type: Class
subclass of: Unit
subclass of: UO_0000109

Poor solvent
type: Class
subclass of: Solution component role
comment: A subclass of the SolutionComponentRole Class, Poor Solvent

Precursor
type: Class
subclass of: Chemical reaction role
comment: A subclass of the ChemicalReactionRole Class, Precursor

Prepolymer
type: Class
subclass of: Chemical reaction role
comment: A subclass of the ChemicalReactionRole Class, Prepolymer

Primary structure
type: Class
subclass of: Structure descriptor
IAO_0000116: PrimaryStructure refers to the primary structure contained in a substance
comment: A subclass of the StructureDescriptor Class, Primary Structure

Primary structure crosslink density
type: Class
subclass of: Structural property
comment: A subclass of the StructuralProperty Class, Primary Structure Crosslink Density

Primary structure type
type: Class
subclass of: Structure type
comment: A subclass of the StructureType Class, Primary Structure Type

Product
type: Class
subclass of: Chemical reaction role
comment: A subclass of the ChemicalReactionRole Class, Product

Product name
type: Class
subclass of: Trade descriptor
comment: A subclass of the TradeDescriptor Class, Product Name

Property
type: Class
subclass of: BFO_0000020
subclass of: Class
  union of: BFO_0000016
  union of: BFO_0000019
comment: Property refers to the physical and chemical properties dealt in PoLyInfo.
comment: Property refers to the properties dealt with in PoLyInfo.

Property value type
type: Class
subclass of: Type descriptor
comment: A subclass of theTypeDescriptor Class, Property Value Type

Pseudo
type: Class
equivalent class: Class
  one of: Pseudo
subclass of: Crystal state
type: NamedIndividual
comment: Pseudo refers to a pseudo-crystalline state as a Crystal State.

PVT relation
type: Class
subclass of: Other property
comment: A subclass of the OtherProperty Class, PVT Relation

PVT relation pressure
type: Class
subclass of: PVT relation
comment: A subclass of the PvtRelation Class, PVT Relation Pressure

PVT relation specific volume
type: Class
subclass of: PVT relation
comment: A subclass of the PvtRelation Class, PVT Relation Specific Volume

PVT relation temperature
type: Class
subclass of: PVT relation
comment: A subclass of the PvtRelation Class, PVT Relation Temperature

R: Growth rate of crystal/spherulite
type: Class
subclass of: Crystallization kinetics
comment: A subclass of the CrystallizationKinetics Class, R Growth Rate Of Crystal Spherulite

Radiation resistance
type: Class
subclass of: Other property
comment: A subclass of the OtherProperty Class, Radiation Resistance

Radius of gyration
type: Class
subclass of: Dilute solution property
comment: A subclass of the DiluteSolutionProperty Class, Radius Of Gyration

Random copolymer
type: Class
subclass of: Copolymer
comment: A subclass of the Copolymer Class, Random Copolymer

Rate
type: Class
subclass of: Transition
comment: A subclass of the Transition Class, Rate

Rational formula
type: Class
subclass of: Molecular descriptor
comment: A subclass of the MolecularDescriptor Class, Rational Formula

Reactant
type: Class
subclass of: Chemical reaction role
comment: A subclass of the ChemicalReactionRole Class, Reactant

Refractive index
type: Class
subclass of: Relational property
comment: A subclass of the RelationalProperty Class, Refractive Index

Relational property
type: Class
subclass of: Property
comment: A subclass of the Property Class, Relational Property. A class of properties that presupposes the existence of other substances.

Relative humidity
type: Class
subclass of: Physical descriptor
comment: A subclass of the PhysicalDescriptor Class, Relative Humidity

Representative name
type: Class
subclass of: Name descriptor
comment: A subclass of the NameDescriptor Class, Representative Name

Resistance stable chemical substance
type: Class
subclass of: Contact substance role
comment: A subclass of the ContactSubstanceRole Class, Resistance Stable Chemical Substance

resistance unit
type: Class
subclass of: Unit
subclass of: UO_0000000

Resistance unstable chemical substance
type: Class
subclass of: Contact substance role
comment: A subclass of the ContactSubstanceRole Class, Resistance Unstable Chemical Substance

Rheological property
type: Class
subclass of: Property
comment: A subclass of the Property Class, Rheological Property

RingOpeningPolymerization
type: Class
subclass of: ChainPolymerization
comment: A subclass of the ChainPolymerization Class, Ring Opening Polymerization

Rockwell hardness
type: Class
subclass of: Hardness
comment: A subclass of the Hardness Class, Rockwell Hardness

Role
type: Class
subclass of: BFO_0000023
subclass of: Restriction
  on property: RO_0000081
  some values from: BFO_0000004
comment: Role refers to the role that appears in PoLyInfo.

Sample structured material
type: Class
subclass of: Material
comment: A subclass of the Material Class, Sample Structured Material

Sample type
type: Class
subclass of: Type descriptor
comment: A subclass of the TypeDescriptor Class, Sample Type

Second virial coefficient
type: Class
subclass of: Relational property
comment: A subclass of the RelationalProperty Class, Second Virial Coefficient

second virial coefficient unit
type: Class
subclass of: Unit
subclass of: UO_0000000

Sedimentation coefficient
type: Class
subclass of: Relational property
comment: A subclass of the RelationalProperty Class, Sedimentation Coefficient

SequentialPolymerization
type: Class
subclass of: Polymerization
comment: A subclass of the Polymerization Class, Sequential Polymerization

Shape
type: Class
subclass of: Geometric descriptor
comment: A subclass of the GeometricDescriptor Class, Shape

Shape and constructional feature
type: Class
subclass of: Shape
comment: A subclass of the Shape Class, Shape And Constructional Feature

Shear loss modulus
type: Class
subclass of: Shear property
comment: A subclass of the ShearProperty Class, Shear Loss Modulus

Shear loss tangent
type: Class
subclass of: Shear property
comment: A subclass of the ShearProperty Class, Shear Loss Tangent

Shear modulus
type: Class
subclass of: Shear property
comment: A subclass of the ShearProperty Class, Shear Modulus

Shear property
type: Class
subclass of: Property
comment: A subclass of the Property Class, Shear Property

Shear storage modulus
type: Class
subclass of: Shear property
comment: A subclass of the ShearProperty Class, Shear Storage Modulus

Shear stress (strength) at break
type: Class
subclass of: Shear property
comment: A subclass of the ShearProperty Class, Shear Stress Strength At Break

Shear stress (strength) at yield
type: Class
subclass of: Shear property
comment: A subclass of the ShearProperty Class, Shear Stress Strength At Yield

Shore hardness
type: Class
subclass of: Hardness
comment: A subclass of the Hardness Class, Shore Hardness

SMILES
type: Class
subclass of: Molecular descriptor
comment: A subclass of the MolecularDescriptor Class, SMILES

Softening temperature
type: Class
subclass of: Heat characteristic
comment: A subclass of the HeatCharacteristic Class, Softening Temperature

Solid state
type: Class
subclass of: Physical state
comment: A subclass of the PhysicalState Class, Solid State

Solid state type
type: Class
subclass of: Physical state type
comment: A subclass of the PhysicalStateType Class, Solid State Type

Solubility parameter
type: Class
subclass of: Physicochemical property
comment: A subclass of the PhysicochemicalProperty Class, Solubility Parameter

solubility parameter unit
type: Class
subclass of: Unit
subclass of: UO_0000000

Solution component role
type: Class
subclass of: Role
comment: A subclass of the Role Class, Solution Component Role

Solution viscosity
type: Class
subclass of: Rheological property
comment: A subclass of the RheologicalProperty Class, Solution Viscosity

Solution viscosity measurement method
type: Class
subclass of: Measurement method
comment: A subclass of the MeasurementMethod Class, Solution Viscosity Measurement Method

Solution viscosity type
type: Class
subclass of: Property value type
comment: A subclass of the PropertyValueType Class, Solution Viscosity Type

Solvent
type: Class
subclass of: Solution component role
comment: A subclass of the SolutionComponentRole Class, Solvent

Source-based name
type: Class
subclass of: Name descriptor
comment: A subclass of the NameDescriptor Class, Source Based Name

Space group
type: Class
subclass of: Crystal state
comment: A subclass of the CrystalState Class, Space Group

specific energy unit
type: Class
subclass of: Unit
subclass of: UO_0000111

Specific heat capacity
type: Class
subclass of: Thermal property
comment: A subclass of the ThermalProperty Class, Specific Heat Capacity

Specific heat capacity (Cp)
type: Class
subclass of: Specific heat capacity
comment: A subclass of the SpecificHeatCapacity Class, Specific Heat Capacity Cp

Specific heat capacity (Cv)
type: Class
subclass of: Specific heat capacity
comment: A subclass of the SpecificHeatCapacity Class, Specific Heat Capacity Cv

specific heat capacity unit
type: Class
subclass of: heat capacity unit

Specific rotatory power
type: Class
subclass of: Optical property
comment: A subclass of the OpticalProperty Class, Specific Rotatory Power

Specific rotatory power measurement method
type: Class
subclass of: Measurement method
comment: A subclass of the MeasurementMethod Class, Specific Rotatory Power Measurement Method

Specific rotatory power measurement standard
type: Class
subclass of: Measurement standard
comment: A subclass of the MeasurementStandard Class, Specific Rotatory Power Measurement Standard

Specific rotatory power standard
type: Class
subclass of: Measurement standard
comment: A subclass of the MeasurementStandard Class, Specific Rotatory Power Standard

specific strength unit
type: Class
subclass of: Unit
subclass of: UO_0000109

Specific volume
type: Class
subclass of: Physical property
comment: A subclass of the PhysicalProperty Class, Specific Volume

square centimeter per second
type: Class
equivalent class: Class
  one of: square centimeter per second
subclass of: mass diffusivity unit
subclass of: square centimeter per second based unit
type: NamedIndividual
has exact synonym: cm^[2]/s

square centimeter per second based unit
type: Class
subclass of: mass diffusivity unit

square meter per newton
type: Class
equivalent class: Class
  one of: square meter per newton
subclass of: elastic compliance unit
subclass of: square meter per newton based unit
type: NamedIndividual
has exact synonym: m^[2]/N

square meter per newton based unit
type: Class
subclass of: elastic compliance unit

square meter per second
type: Class
equivalent class: Class
  one of: square meter per second
subclass of: mass diffusivity unit
subclass of: square meter per second based unit
type: NamedIndividual
has exact synonym: m^[2]/s

square meter per second based unit
type: Class
subclass of: mass diffusivity unit

square millimeter per second
type: Class
equivalent class: Class
  one of: square millimeter per second
subclass of: mass diffusivity unit
subclass of: square millimeter per second based unit
type: NamedIndividual
has exact synonym: mm^[2]/s

square millimeter per second based unit
type: Class
subclass of: mass diffusivity unit

square root of joule per cubic centimeter
type: Class
equivalent class: Class
  one of: square root of joule per cubic centimeter
subclass of: solubility parameter unit
subclass of: square root of joule per cubic centimeter based unit
type: NamedIndividual

square root of joule per cubic centimeter based unit
type: Class
subclass of: solubility parameter unit
has exact synonym: (J/cm3)1/2
has exact synonym: (J/cm^[3])^[1/2]

State change descriptor
type: Class
subclass of: Descriptor
comment: A subclass of the Descriptor Class, State Change Descriptor

Statistical copolymer
type: Class
subclass of: Copolymer
comment: A subclass of the Copolymer Class, Statistical Copolymer

Stereoregularity
type: Class
subclass of: Primary structure
comment: A subclass of the PrimaryStructure Class, Stereoregularity

Stereoregularity measurement method
type: Class
subclass of: Measurement method
comment: A subclass of the MeasurementMethod Class, Stereoregularity Measurement Method

Stereoregularity type
type: Class
subclass of: Primary structure type
comment: A subclass of the PrimaryStructureType Class, Stereoregularity Type

stokes based unit
type: Class
subclass of: kinematic viscosity unit

Stress-optical coefficient
type: Class
subclass of: Optical property
comment: A subclass of the OpticalProperty Class, Stress Optical Coefficient

Structural property
type: Class
subclass of: Property
comment: A subclass of the Property Class, Structural Property

Structure-based name
type: Class
subclass of: Name descriptor
comment: A subclass of the NameDescriptor Class, Structure Based Name

Structure descriptor
type: Class
subclass of: Descriptor
comment: A subclass of the Descriptor Class, Structure Descriptor

Structure type
type: Class
subclass of: Type descriptor
comment: A subclass of the TypeDescriptor Class, Sructure Type

Surface resistivity
type: Class
subclass of: Electric resistivity
comment: A subclass of the ElectricResistivity Class, Surface Resistivity

surface resistivity unit
type: Class
subclass of: resistance unit

Surface tension
type: Class
subclass of: Physicochemical property
comment: A subclass of the PhysicochemicalProperty Class, Surface Tension

Temperature
type: Class
subclass of: Physical descriptor
comment: A subclass of the PhysicalDescriptor Class, Temperature

Tensile
type: Class
subclass of: Dynamic tensile property
comment: A subclass of the Dynam icTensileProperty Class, Tensile

Tensile creep compliance
type: Class
subclass of: Tensile creep property
comment: A subclass of the TensileCreepProperty Class, Tensile Creep Compliance

Tensile creep modulus
type: Class
subclass of: Tensile creep property
comment: A subclass of the TensileCreepProperty Class, Tensile Creep Modulus

Tensile creep property
type: Class
subclass of: Creep property
comment: A subclass of the CreepProperty Class, Tensile Creep Property

Tensile creep recovery
type: Class
subclass of: Tensile creep property
comment: A subclass of the TensileCreepProperty Class, Tensile Creep Recovery

Tensile creep rupture strength
type: Class
subclass of: Tensile creep property
comment: A subclass of the TensileCreepProperty Class, Tensile Creep Rupture Strength

Tensile creep rupture time
type: Class
subclass of: Tensile creep property
comment: A subclass of the TensileCreepProperty Class, Tensile Creep Rupture Time

Tensile creep strain
type: Class
subclass of: Tensile creep property
comment: A subclass of the TensileCreepProperty Class, Tensile Creep Strain

Tensile loss modulus
type: Class
subclass of: Tensile property
comment: A subclass of the TensileProperty Class, Tensile Loss Modulus

Tensile loss tangent
type: Class
subclass of: Tensile property
comment: A subclass of the TensileProperty Class, Tensile Loss Tangent

Tensile modulus
type: Class
subclass of: Tensile
comment: A subclass of the Tensile Class, Tensile Modulus

Tensile property
type: Class
subclass of: Property
comment: A subclass of the Property Class, Tensile Property

Tensile storage modulus
type: Class
subclass of: Tensile property
comment: A subclass of the TensileProperty Class, Tensile Storage Modulus

Tensile stress (strength) at break
type: Class
subclass of: Tensile
comment: A subclass of the Tensile Class, Tensile Stress Strength At Break

Tensile stress (strength) at yield
type: Class
subclass of: Tensile
comment: A subclass of the Tensile Class, Tensile Stress Strength At Yield

Terminator
type: Class
subclass of: Polymerization role
comment: A subclass of the PolymerizationRole Class, Terminator

Tetragonal
type: Class
equivalent class: Class
  one of: Tetragonal
subclass of: Crystal system
type: NamedIndividual
comment: Tetragonal refers to Tetragonal as a Crystal System.

Thermal conductivity
type: Class
subclass of: Heat conduction
comment: A subclass of the HeatConduction Class, Thermal Conductivity

Thermal decomposition
type: Class
subclass of: Thermal property
comment: A subclass of the ThermalProperty Class, Thermal Decomposition

Thermal decomposition temperature
type: Class
subclass of: Thermal decomposition
subclass of: Restriction
  on property: BFO_0000051
  some values from: Thermal decomposition temperature (Temperature)
subclass of: Restriction
  on property: BFO_0000051
  some values from: Thermal decomposition temperature (Weight loss)
comment: A subclass of the ThermalDecomposition Class, Thermal Decomposition Temperature

Thermal decomposition temperature (Temperature)
type: Class
subclass of: Physical property
comment: A subclass of the PhysicalProperty Class, Thermal Decomposition Temperature (Temperature)

Thermal decomposition temperature (Weight loss)
type: Class
subclass of: Physical property
comment: A subclass of the PhysicalProperty Class, Thermal Decomposition Temperature (Weight Loss)

Thermal diffusivity
type: Class
subclass of: Heat conduction
comment: A subclass of the HeatConduction Class, Thermal Diffusivity

Thermal expansion
type: Class
subclass of: Thermal property
comment: A subclass of the ThermalProperty Class, Thermal Expansion

thermal expansion unit
type: Class
subclass of: Unit
subclass of: UO_0000000

Thermal property
type: Class
subclass of: Property
comment: A subclass of the Property Class, Thermal Property

Theta-solvent/Theta-temperature
type: Class
subclass of: Relational property
comment: A subclass of the RelationalProperty Class, Theta Solvent Theta Temperature

Time
type: Class
subclass of: Physical descriptor
comment: A subclass of the PhysicalDescriptor Class, Time

Trade descriptor
type: Class
subclass of: Descriptor
comment: A subclass of the Descriptor Class, Trade Descriptor

Trade grade
type: Class
subclass of: Trade descriptor
comment: A subclass of the TradeDescriptor Class, Trade Grade

Transition
type: Class
subclass of: State change descriptor
comment: A subclass of the StateChangeDescriptor Class, Transition

Triclinic
type: Class
equivalent class: Class
  one of: Triclinic
subclass of: Crystal system
type: NamedIndividual
comment: Triclinic refers to Triclinic as a Crystal System.

Trigonal/Rhombohedral
type: Class
equivalent class: Class
  one of: Trigonal/Rhombohedral
subclass of: Crystal system
type: NamedIndividual
comment: TrigonalRhombohedral refers to Trigonal/Rhombohedral as a Crystal System.

Type descriptor
type: Class
subclass of: Descriptor
comment: A subclass of the Descriptor Class,Type Descriptor

UL Flammability code rating
type: Class
subclass of: Heat resistance and Combustion
comment: A subclass of the HeatResistanceAndCombustion Class, Ul Flammability Code Rating

UL flammability code rating type
type: Class
subclass of: Property value type
comment: A subclass of the PropertyValueType Class, Ul Flammability Code Rating Type

UL temperature index
type: Class
subclass of: Heat resistance and Combustion
subclass of: Restriction
  on property: BFO_0000051
  some values from: UL temperature index temperature
subclass of: Restriction
  on property: BFO_0000051
  some values from: UL temperature index time
comment: A subclass of the HeatResistanceAndCombustion Class, Ul Temperature Index

UL temperature index temperature
type: Class
subclass of: Physical property
comment: A subclass of the PhysicalProperty Class, Ul Temperature Index Temperature

UL temperature index time
type: Class
subclass of: Physical property
comment: A subclass of the PhysicalProperty Class, Ul Temperature Index Time

Uniformization
type: Class
subclass of: Material processing
comment: A subclass of the MaterialProcessing Class, Uniformization

Unit
type: Class
subclass of: IAO_0000003
subclass of: UO_0000000
comment: Unit refers to the units used in PoLyInfo.

Vicat softening temperature
type: Class
subclass of: Heat characteristic
comment: A subclass of the HeatCharacteristic Class, Vicat Softening Temperature

Viscosity-average molecular weight
type: Class
subclass of: Average molecular weight
comment: A subclass of the AverageMolecularWeight Class, Viscosity Average Molecular Weight (Mv)

volt per millimeter based unit
type: Class
subclass of: Unit
subclass of: UO_0000267

Voltage
type: Class
subclass of: Physical descriptor
comment: A subclass of the PhysicalDescriptor Class, Voltage

Volume expansion coefficient
type: Class
subclass of: Thermal expansion
comment: A subclass of the ThermalExpansion Class, Volume Expansion Coefficient

Volume resistivity
type: Class
subclass of: Electric resistivity
comment: A subclass of the ElectricResistivity Class, Volume Resistivity

volume resistivity unit
type: Class
subclass of: resistance unit

Water absorption
type: Class
subclass of: Physicochemical property
comment: A subclass of the PhysicochemicalProperty Class, Water Absorption

Water vapor transmission
type: Class
subclass of: Physicochemical property
comment: A subclass of the PhysicochemicalProperty Class, Water Vapor Transmission

water vapor transmission unit
type: Class
subclass of: Unit
subclass of: UO_0000000

watt per centimeter kelvin based unit
type: Class
subclass of: Unit
subclass of: UO_0000263

Wavelength
type: Class
subclass of: Physical descriptor
comment: A subclass of the PhysicalDescriptor Class, Wavelength

Weight-average molecular weight
type: Class
subclass of: Average molecular weight
comment: A subclass of the AverageMolecularWeight Class, Weight-Average Molecular Weight (Mw)

Z-average molecular weight
type: Class
subclass of: Average molecular weight
comment: A subclass of the AverageMolecularWeight Class, Z-Average Molecular Weight (Mz)

Addition polymerization/Polymer reaction
type: NamedIndividual
type: Polymerization reaction type
comment: A type of the PolymerizationReactionType Class, Addition Polymerization Polymer Reaction

Addition polymerization system
type: NamedIndividual
type: Polymerization reaction type
comment: A type of the PolymerizationReactionType Class, Addition Polymerization System

Amorphous
type: NamedIndividual
type: Crystallinity type
comment: A type of the CrystallinityType Class, Amorphous

Branched
type: NamedIndividual
type: Shape and constructional feature
comment: A type of the ShapeAndConstructionalFeature Class, Branched

Branching part
type: NamedIndividual
type: End group part type
comment: A type of the EndGroupPartType Class, Branching Part

Bulk polymerization
type: NamedIndividual
type: Polymerization phase type
comment: A type of the PolymerizationPhaseType Class, Bulk Polymerization

Catenane
type: NamedIndividual
type: Shape and constructional feature
comment: A type of the ShapeAndConstructionalFeature Class, Catenane

Central part of star polymer
type: NamedIndividual
type: End group part type
comment: A type of the EndGroupPartType Class, Central Part Of Star Polymer

Chelate polymer
type: NamedIndividual
type: Sample type
comment: A type of the SampleType Class, Chelate Polymer

Cluster
type: NamedIndividual
type: Shape and constructional feature
comment: A type of the ShapeAndConstructionalFeature Class, Cluster

Comb
type: NamedIndividual
type: Shape and constructional feature
comment: A type of the ShapeAndConstructionalFeature Class, Comb

Complex
type: NamedIndividual
type: Shape and constructional feature
comment: A type of the ShapeAndConstructionalFeature Class, Complex

Composite
type: NamedIndividual
type: Sample type
comment: A type of the SampleType Class, Composite

Compound
type: NamedIndividual
type: Sample type
comment: A type of the SampleType Class, Compound

Copolymers
type: NamedIndividual
type: Polymer class
comment: A type of the PolymerType Class, Copolymers

Crosslinked
type: NamedIndividual
type: Shape and constructional feature
comment: A type of the ShapeAndConstructionalFeature Class, Crosslinked

Crystal
type: NamedIndividual
type: Crystallinity type
comment: A type of the CrystallinityType Class, Crystal

Dendrimer
type: NamedIndividual
type: Shape and constructional feature
comment: A type of the ShapeAndConstructionalFeature Class, Dendrimer

Elastomer
type: NamedIndividual
type: General feature
comment: A type of the GeneralFeature Class, Elastomer

Emulsion polymerization
type: NamedIndividual
type: Polymerization phase type
comment: A type of the PolymerizationPhaseType Class, Emulsion Polymerization

End
type: NamedIndividual
type: End group type
comment: A type of the EndGroupType Class, End

End group part
type: NamedIndividual
type: End group part type
comment: A type of the EndGroupPartType Class, End Group Part

Eta Inh
type: NamedIndividual
type: Solution viscosity type
comment: A type of the SolutionViscosityType Class, Eta Inh

Gas-phase polymerization
type: NamedIndividual
type: Polymerization phase type
comment: A type of the PolymerizationPhaseType Class, Gas-Phase Polymerization

Hyper-Branched
type: NamedIndividual
type: Shape and constructional feature
comment: A type of the ShapeAndConstructionalFeature Class, Hyper-Branched

Inclusion compd.
type: NamedIndividual
type: Shape and constructional feature
comment: A type of the ShapeAndConstructionalFeature Class, Inclusion Compd.

Inorganic polymer
type: NamedIndividual
type: Sample type
comment: A type of the SampleType Class, Inorganic Polymer

Intercalation
type: NamedIndividual
type: Shape and constructional feature
comment: A type of the ShapeAndConstructionalFeature Class, Intercalation

Interfacial polymerization
type: NamedIndividual
type: Polymerization phase type
comment: A type of the PolymerizationPhaseType Class, Interfacial Polymerization

Ionic
type: NamedIndividual
type: Shape and constructional feature
comment: A type of the ShapeAndConstructionalFeature Class, Intercalation

Ionomer
type: NamedIndividual
type: Shape and constructional feature
comment: A type of the ShapeAndConstructionalFeature Class, Ionomer

IPN
type: NamedIndividual
type: Shape and constructional feature
comment: A type of the ShapeAndConstructionalFeature Class, IPN

Junction part
type: NamedIndividual
type: End group part type
comment: A type of the EndGroupPartType Class, Junction Part

Ladder
type: NamedIndividual
type: Shape and constructional feature
comment: A type of the ShapeAndConstructionalFeature Class, Ladder

Linear
type: NamedIndividual
type: Shape and constructional feature
comment: A type of the ShapeAndConstructionalFeature Class, Linear

Liquid
type: NamedIndividual
type: General feature
comment: A type of the GeneralFeature Class, Liquid

ma
type: NamedIndividual
type: End group connection type
comment: A type of the EndGroupConnectionType Class, ma

Macrocycle
type: NamedIndividual
type: Shape and constructional feature
comment: A type of the ShapeAndConstructionalFeature Class, Macrocycle

mo
type: NamedIndividual
type: End group connection type
comment: A type of the EndGroupConnectionType Class, mo

NR
type: NamedIndividual
type: Unit
comment: When a unit cannot be registered due to reasons such as the unit not being described in the reference, this instance is used as the object of has_unit.

Neat resin
type: NamedIndividual
type: Sample type
comment: A type of the SampleType Class, Neat Resin

Network (2-Dimensional)
type: NamedIndividual
type: Shape and constructional feature
comment: A type of the ShapeAndConstructionalFeature Class, Network (2-Dimensional)

Other polymers
type: NamedIndividual
type: Polymer class
comment: A type of the PolymerType Class, Other Polymers

Overall
type: NamedIndividual
type: Crystallinity type
comment: A type of the CrystallinityType Class, Overall

Polyacrylics
type: NamedIndividual
type: Polymer class
comment: A type of the PolymerType Class, Polyacrylics

Polyaddition/Polymer reaction
type: NamedIndividual
type: Polymerization reaction type
comment: A type of the PolymerizationReactionType Class, Polyaddition Polymer Reaction

Polyaddition system
type: NamedIndividual
type: Polymerization reaction type
comment: A type of the PolymerizationReactionType Class, Polyaddition System

Polyamides
type: NamedIndividual
type: Polymer class
comment: A type of the PolymerType Class, Polyamides

Polyanhydrides
type: NamedIndividual
type: Polymer class
comment: A type of the PolymerType Class, Polyanhydrides

Polycarbonates
type: NamedIndividual
type: Polymer class
comment: A type of the PolymerType Class, Polycarbonates

Polycondensation/Polymer reaction
type: NamedIndividual
type: Polymerization reaction type
comment: A type of the PolymerizationReactionType Class, Polycondensation Polymer Reaction

Polycondensation system
type: NamedIndividual
type: Polymerization reaction type
comment: A type of the PolymerizationReactionType Class, Polycondensation System

Polydienes
type: NamedIndividual
type: Polymer class
comment: A type of the PolymerType Class, Polydienes

Polyelectrolyte
type: NamedIndividual
type: Shape and constructional feature
comment: A type of the ShapeAndConstructionalFeature Class, Polyelectrolyte

Polyesters
type: NamedIndividual
type: Polymer class
comment: A type of the PolymerType Class, Polyesters

PolyhaloOlefins
type: NamedIndividual
type: Polymer class
comment: A type of the PolymerType Class, PolyhaloOlefins

Polyimides
type: NamedIndividual
type: Polymer class
comment: A type of the PolymerType Class, Polyimides

Polyimines
type: NamedIndividual
type: Polymer class
comment: A type of the PolymerType Class, Polyimines

Polyketones
type: NamedIndividual
type: Polymer class
comment: A type of the PolymerType Class, Polyketones

Polyolefins
type: NamedIndividual
type: Polymer class
comment: A type of the PolymerType Class, Polyolefins

Polyoxides
type: NamedIndividual
type: Polymer class
comment: A type of the PolymerType Class, Polyoxides

Polyphenylenes
type: NamedIndividual
type: Polymer class
comment: A type of the PolymerType Class, Polyphenylenes

Polyphosphazenes
type: NamedIndividual
type: Polymer class
comment: A type of the PolymerType Class, Polyphosphazenes

Polyrotaxane
type: NamedIndividual
type: Shape and constructional feature
comment: A type of the ShapeAndConstructionalFeature Class, Polyrotaxane

Polysiloxanes
type: NamedIndividual
type: Polymer class
comment: A type of the PolymerType Class, Polysiloxanes

Polystyrenes
type: NamedIndividual
type: Polymer class
comment: A type of the PolymerType Class, Polystyrenes

Polysulfides
type: NamedIndividual
type: Polymer class
comment: A type of the PolymerType Class, Polysulfides

Polysulfones
type: NamedIndividual
type: Polymer class
comment: A type of the PolymerType Class, Polysulfones

Polyureas
type: NamedIndividual
type: Polymer class
comment: A type of the PolymerType Class, Polyureas

Polyurethanes
type: NamedIndividual
type: Polymer class
comment: A type of the PolymerType Class, Polyurethanes

Polyvinyls
type: NamedIndividual
type: Polymer class
comment: A type of the PolymerType Class, Polyvinyls

Reduced viscosity
type: NamedIndividual
type: Solution viscosity type
comment: A type of the SolutionViscosityType Class, Reduced Viscosity

Relative viscosity
type: NamedIndividual
type: Solution viscosity type
comment: A type of the SolutionViscosityType Class, Relative Viscosity

Ring opening and addition polymerization
type: NamedIndividual
type: Polymerization reaction type
comment: A type of the PolymerizationReactionType Class, Ring Opening And Addition Polymerization

Ring opening and addition polymerization/Polymer reaction
type: NamedIndividual
type: Polymerization reaction type
comment: A type of the PolymerizationReactionType Class, Ring Opening and Addition Polymerization/Polymer Reaction

Ring opening and polyaddition polymerization
type: NamedIndividual
type: Polymerization reaction type
comment: A type of the PolymerizationReactionType Class, Ring Opening And Polyaddition Polymerization

Ring opening and polyaddition polymerization/Polymer reaction
type: NamedIndividual
type: Polymerization reaction type
comment: A type of the PolymerizationReactionType Class, Ring Opening And Polyaddition Polymerization/ Polymer Reaction

Ring opening and polycondensation polymerization
type: NamedIndividual
type: Polymerization reaction type
comment: A type of the PolymerizationReactionType Class, Ring Opening and Polycondensation Polymerization

Ring opening and polycondensation polymerization/Polymer reaction
type: NamedIndividual
type: Polymerization reaction type
comment: A type of the PolymerizationReactionType Class, Ring Opening and Polycondensation Polymerization/Polymer Reaction

Ring opening polymerization/Polymer reaction
type: NamedIndividual
type: Polymerization reaction type
comment: A type of the PolymerizationReactionType Class, Ring Opening Polymerization/Polymer Reaction

Ring opening polymerization system
type: NamedIndividual
type: Polymerization reaction type
comment: A type of the PolymerizationReactionType Class, Ring Opening Polymerization System

Semi-IPV
type: NamedIndividual
type: Shape and constructional feature
comment: A type of the ShapeAndConstructionalFeature Class, Semi-IPV

so
type: NamedIndividual
type: End group connection type
comment: A type of the EndGroupConnectionType Class, so

Solid-state polymerization
type: NamedIndividual
type: Polymerization phase type
comment: A type of the PolymerizationPhaseType Class, Solid-state Polymerization

Solution polymerization
type: NamedIndividual
type: Polymerization phase type
comment: A type of the PolymerizationPhaseType Class, Solution Polymerization

Specific viscosity (Relative viscosity increment)
type: NamedIndividual
type: Solution viscosity type
comment: A type of the SolutionViscosityType Class, Specific Viscosity (Relative Viscosity Increment)

Spiro
type: NamedIndividual
type: Shape and constructional feature
comment: A type of the ShapeAndConstructionalFeature Class, Spiro

Star
type: NamedIndividual
type: Shape and constructional feature
comment: A type of the ShapeAndConstructionalFeature Class, Star

Suspension polymerization
type: NamedIndividual
type: Polymerization phase type
comment: A type of the PolymerizationPhaseType Class, Suspension Polymerization

Thermoplastic
type: NamedIndividual
type: General feature
comment: A type of the GeneralFeature Class, Thermoplastic

Thermoplastic elastomer
type: NamedIndividual
type: General feature
comment: A type of the GeneralFeature Class, Thermoplastic Elastomer

Thermosetting
type: NamedIndividual
type: General feature
comment: A type of the GeneralFeature Class, Thermosetting

Unknown
type: NamedIndividual
type: Crystallinity type
comment: A type of the CrystallinityType Class, Unknown

Vesicle
type: NamedIndividual
type: Shape and constructional feature
comment: A type of the ShapeAndConstructionalFeature Class, Vesicle

UO_0000265
has exact synonym: J/m s K